BDBM50145107 (2S)-2-{[(2R)-1-{[(4S,7R,13R,16S)-10-(3-aminopropyl)-13-benzyl-7-(carbamoylmethyl)-16-[(4-hydroxyphenyl)methyl]-6,9,12,15,18-pentaoxo-1,2-dithia-5,8,11,14,17-pentaazacycloicosan-4-yl]carbonyl}pyrrolidin-2-yl]formamido}-N-(carbamoylmethyl)-5-[(diaminomethylidene)amino]pentanamide::CHEMBL440610
SMILES NCCCC1NC(=O)[C@@H](Cc2ccccc2)NC(=O)[C@H](Cc2ccc(O)cc2)NC(=O)CCSSC[C@@H](NC(=O)[C@@H](CC(N)=O)NC1=O)C(=O)N1CCC[C@@H]1C(=O)N[C@@H](CCCNC(N)=N)C(=O)NCC(N)=O
InChI Key InChIKey=HBVZQPKQFUSYKR-YYOFHRBWSA-N
Data  4 KI
  Tab Delimited (TSV)   2D SDfile   Computed 3D by Vconf -m prep SDfile
Find this compound or compounds like it in BindingDB:
Activity Spreadsheet -- Enzyme Inhibition Constant Data from BindingDB
Found 1 hit for monomerid = 50145107
TargetVasopressin V1b receptor(Homo sapiens (Human))
Medical College Of Ohio
Curated by ChEMBL
LigandPNGBDBM50145107((2S)-2-{[(2R)-1-{[(4S,7R,13R,16S)-10-(3-aminopropy...)
Affinity DataKi:  0.490nM. Assay description: Binding affinity against human vasopressin V1b receptor was determined by using plasma membranes from CHO cells stably transfected with VP/OT recepto...
In DepthDetails ArticlePubMed